BDBM50004383 2-{4-[(2-Chloro-4-methyl-quinolin-6-ylmethyl)-prop-2-ynyl-amino]-benzoylamino}-pentanedioic acid ; hydrate::CHEMBL96355
SMILES Cc1cc(Cl)nc2ccc(CN(CC#C)c3ccc(cc3)C(=O)N[C@@H](CCC(O)=O)C(O)=O)cc12
InChI Key InChIKey=ALZXNLVYEHMAJV-QFIPXVFZSA-N
Data  1 IC50
  Tab Delimited (TSV)   2D SDfile   Computed 3D by Vconf -m prep SDfile
Find this compound or compounds like it in BindingDB:
Activity Spreadsheet -- Enzyme Inhibition Constant Data from BindingDB
Found 1 hit for monomerid = 50004383
TargetThymidylate synthase(Mus musculus)
Ici Pharmaceuticals Group
Curated by ChEMBL
LigandPNGBDBM50004383(2-{4-[(2-Chloro-4-methyl-quinolin-6-ylmethyl)-prop...)
Affinity DataIC50:  120nM. Assay description: In vitro inhibitory activity against thymidylate synthase from L1210 mouse leukemia cells
In DepthDetails ArticlePubMed